BDBM50288950 11'N-(3-iodobenzyl)spiro[dihydro[1,3]dioxolane-2,8'-pentacyclo[5.4.0.02,6.03,10.05,9]undecane]-11'-amine; hydrochloride::CHEMBL1189714::CHEMBL539310
SMILES Ic1cccc(CNC2C3C4C5C3C3(OCCO3)C3C5CC4C23)c1
InChI Key InChIKey=MUPHFIXXGVFOQG-UHFFFAOYSA-N
Data  2 KI
  Tab Delimited (TSV)   2D SDfile   Computed 3D by Vconf -m prep SDfile
Find this compound or compounds like it in BindingDB:
Activity Spreadsheet -- Enzyme Inhibition Constant Data from BindingDB
Found 2 hits for monomerid = 50288950
TargetSigma non-opioid intracellular receptor 1(Homo sapiens (Human))
TBA
Curated by ChEMBL
LigandPNGBDBM50288950(11'N-(3-iodobenzyl)spiro[dihydro[1,3]dioxolane-2,8...)
Affinity DataKi:  58nM. Assay description: Binding affinity towards sigma receptor in guinea pig brain membrane was determined by using [3H]DTG as the radioligand
In DepthDetails Article
TargetSigma non-opioid intracellular receptor 1(Cavia porcellus (Guinea pig))
Northeast Ohio Medical University
Curated by ChEMBL
LigandPNGBDBM50288950(11'N-(3-iodobenzyl)spiro[dihydro[1,3]dioxolane-2,8...)
Affinity DataKi:  123nM. Assay description: Displacement of [3H](+)-pentazocine from sigma-1 receptor in guinea pig brain
In DepthDetails ArticlePubMed