BDBM50289117 CHEMBL407422::RES-701-1-C-terminal analogue
SMILES C[C@@H](O)[C@H]1NC(=O)CNC(=O)[C@@H](Cc2cnc[nH]2)NC(=O)[C@H](Cc2c[nH]c3ccccc23)NC(=O)[C@@H](CC(N)=O)NC(=O)CNC(=O)C[C@@H](NC(=O)[C@H]2CCCN2C(=O)[C@H](C)NC1=O)C(=O)N[C@@H](Cc1c[nH]c2ccccc12)C(=O)N[C@@H](Cc1ccccc1)C(=O)N[C@@H](Cc1ccccc1)C(=O)N[C@@H](CC(N)=O)C(=O)N[C@@H](Cc1ccc(O)cc1)C(=O)N[C@@H](Cc1ccc(O)cc1)C(=O)N[C@H](Cc1ccc(O)cc1)C(O)=O
InChI Key InChIKey=MYKVZRYMXGTARG-RWGFVQOJSA-N
Data  1 IC50
  Tab Delimited (TSV)   2D SDfile   Computed 3D by Vconf -m prep SDfile
Find this compound or compounds like it in BindingDB:
Activity Spreadsheet -- Enzyme Inhibition Constant Data from BindingDB
Found 1 hit for monomerid = 50289117
TargetEndothelin receptor type B(Bos taurus)
TBA
Curated by ChEMBL
LigandPNGBDBM50289117(CHEMBL407422 | RES-701-1-C-terminal analogue)
Affinity DataIC50:  45nM. Assay description: Binding activity against Endothelin B receptor expressed from bovine cerebellum membrane preparation
In DepthDetails Article