BDBM50289274 CHEMBL309610::[(R)-1-{(S)-1-[(S)-1-((S)-1-Carbamoyl-3-methyl-butylcarbamoyl)-ethylcarbamoyl]-2-methyl-propylcarbamoyl}-2-(4-nitro-phenyl)-ethyl]-carbamic acid ethyl ester
SMILES CCOC(=O)N[C@H](Cc1ccc(cc1)[N+]([O-])=O)C(=O)N[C@@H](C(C)C)C(=O)N[C@@H](C)C(=O)N[C@@H](CC(C)C)C(N)=O
InChI Key InChIKey=BYLMLBNZGUUZRW-DVWBAYGPSA-N
Data  2 IC50
  Tab Delimited (TSV)   2D SDfile   Computed 3D by Vconf -m prep SDfile
Find this compound or compounds like it in BindingDB:
Activity Spreadsheet -- Enzyme Inhibition Constant Data from BindingDB
Found 2 hits for monomerid = 50289274
TargetMHC class II antigen(Homo sapiens (Human))
TBA
Curated by ChEMBL
LigandPNGBDBM50289274(CHEMBL309610 | [(R)-1-{(S)-1-[(S)-1-((S)-1-Carbamo...)
Affinity DataIC50:  140nM. Assay description: Inhibitory concentration to inhibit the binding of biotinylated rat myelin basic protein peptide (RMBP90-102) against DR1 allele of class II MHC for ...
In DepthDetails Article
TargetMHC class II antigen(Homo sapiens (Human))
TBA
Curated by ChEMBL
LigandPNGBDBM50289274(CHEMBL309610 | [(R)-1-{(S)-1-[(S)-1-((S)-1-Carbamo...)
Affinity DataIC50:  600nM. Assay description: Inhibitory concentration required to inhibit the binding of biotinylated rat myelin basic protein peptide (RMBP90-102) against DR1 allele of class II...
In DepthDetails Article