BDBM50289468 8-(Hydroxy-octyloxy-phosphoryl)-naphthalene-2-carboxylic acid::CHEMBL33440
SMILES CCCCCCCCOP(O)(=O)c1cccc2ccc(cc12)C(O)=O
InChI Key InChIKey=NXHSZSSEOHEZNV-UHFFFAOYSA-N
Data  1 IC50
  Tab Delimited (TSV)   2D SDfile   Computed 3D by Vconf -m prep SDfile
Find this compound or compounds like it in BindingDB:
Activity Spreadsheet -- Enzyme Inhibition Constant Data from BindingDB
Found 1 hit for monomerid = 50289468
TargetGroup IID secretory phospholipase A2(Homo sapiens (Human))
TBA
Curated by ChEMBL
LigandPNGBDBM50289468(8-(Hydroxy-octyloxy-phosphoryl)-naphthalene-2-carb...)
Affinity DataIC50: >2.00E+5nM. Assay description: Compound was measured for the inhibitory activity against Secretory phospholipase A 2 (s-PLA2)
In DepthDetails Article