BDBM50289801 CHEMBL292766::[(S)-2-(1H-Indol-3-yl)-1-phenethylcarbamoyl-ethyl]-carbamic acid benzyl ester
SMILES O=C(N[C@@H](Cc1c[nH]c2ccccc12)C(=O)NCCc1ccccc1)OCc1ccccc1
InChI Key InChIKey=GTTXOKRFAXQYEU-VWLOTQADSA-N
Data  1 KI  1 IC50
  Tab Delimited (TSV)   2D SDfile   Computed 3D by Vconf -m prep SDfile
Find this compound or compounds like it in BindingDB:
Activity Spreadsheet -- Enzyme Inhibition Constant Data from BindingDB
Found 2 hits for monomerid = 50289801
TargetNeuromedin-B receptor(Homo sapiens (Human))
TBA
Curated by ChEMBL
LigandPNGBDBM50289801(CHEMBL292766 | [(S)-2-(1H-Indol-3-yl)-1-phenethylc...)
Affinity DataKi:  2.60E+3nM. Assay description: Binding affinity for human neuromedin B(hNMB) receptor expressed in CHO cells
In DepthDetails Article
TargetSubstance-K receptor(HAMSTER)
TBA
Curated by ChEMBL
LigandPNGBDBM50289801(CHEMBL292766 | [(S)-2-(1H-Indol-3-yl)-1-phenethylc...)
Affinity DataIC50:  3.27E+3nM. Assay description: Concentration required for binding affinity to neurokinin (NK2) receptor in hamster urinary bladder
In DepthDetails Article