BDBM50289808 CHEMBL61615::[(S)-2-(1H-Indol-3-yl)-1-phenethylcarbamoyl-ethyl]-carbamic acid isobutyl ester
SMILES CC(C)COC(=O)N[C@@H](Cc1c[nH]c2ccccc12)C(=O)NCCc1ccccc1
InChI Key InChIKey=HDYAWNAYZSXPPS-QFIPXVFZSA-N
Data  1 KI
  Tab Delimited (TSV)   2D SDfile   Computed 3D by Vconf -m prep SDfile
Find this compound or compounds like it in BindingDB:
Activity Spreadsheet -- Enzyme Inhibition Constant Data from BindingDB
Found 1 hit for monomerid = 50289808
TargetNeuromedin-B receptor(Homo sapiens (Human))
TBA
Curated by ChEMBL
LigandPNGBDBM50289808(CHEMBL61615 | [(S)-2-(1H-Indol-3-yl)-1-phenethylca...)
Affinity DataKi:  4.30E+3nM. Assay description: Binding affinity for human neuromedin B(hNMB) receptor expressed in CHO cells
In DepthDetails Article