BDBM50289824 CHEMBL304238::[(S)-1-(2-Hydroxy-ethylcarbamoyl)-2-(1H-indol-3-yl)-ethyl]-carbamic acid isopropyl ester
SMILES CC(C)OC(=O)N[C@@H](Cc1c[nH]c2ccccc12)C(=O)NCCO
InChI Key InChIKey=AJSTWDJCOSAIMU-HNNXBMFYSA-N
Data  1 KI
  Tab Delimited (TSV)   2D SDfile   Computed 3D by Vconf -m prep SDfile
Find this compound or compounds like it in BindingDB:
Activity Spreadsheet -- Enzyme Inhibition Constant Data from BindingDB
Found 1 hit for monomerid = 50289824
TargetNeuromedin-B receptor(Homo sapiens (Human))
TBA
Curated by ChEMBL
LigandPNGBDBM50289824(CHEMBL304238 | [(S)-1-(2-Hydroxy-ethylcarbamoyl)-2...)
Affinity DataKi: >1.00E+4nM. Assay description: Binding affinity for human neuromedin B(hNMB) receptor expressed in CHO cells
In DepthDetails Article