BDBM50289850 CHEMBL59055::[(S)-2-(1H-Indol-3-yl)-1-isobutylcarbamoyl-ethyl]-carbamic acid 2-(1H-indol-3-yl)-ethyl ester
SMILES CC(C)CNC(=O)[C@H](Cc1c[nH]c2ccccc12)NC(=O)OCCc1c[nH]c2ccccc12
InChI Key InChIKey=FHDWPVYJLZZWDV-DEOSSOPVSA-N
Data  1 KI
  Tab Delimited (TSV)   2D SDfile   Computed 3D by Vconf -m prep SDfile
Find this compound or compounds like it in BindingDB:
Activity Spreadsheet -- Enzyme Inhibition Constant Data from BindingDB
Found 1 hit for monomerid = 50289850
TargetNeuromedin-B receptor(Homo sapiens (Human))
TBA
Curated by ChEMBL
LigandPNGBDBM50289850(CHEMBL59055 | [(S)-2-(1H-Indol-3-yl)-1-isobutylcar...)
Affinity DataKi:  3.50E+3nM. Assay description: Binding affinity for human neuromedin B(hNMB) receptor expressed in CHO cells
In DepthDetails Article