BDBM50289914 1N-[21-(2-aminoethoxy)-3-[3-(1,5-diaminopentylcarboxamido)-1-hydroxypropyl]-6-[1,2-dihydroxy-2-(4-hydroxyphenyl)ethyl]-11,20,25-trihydroxy-15-(1-hydroxyethyl)-2,5,8,14,17,23-hexaoxo-1,4,7,13,16,22-hexaazatricyclo[22.2.1.09,13]heptacos-18-yl]-10,12-d::CHEMBL413521
SMILES CCC(C)CC(C)CCCCCCCCC(=O)NC1C[C@@H](O)[C@H](NC(=O)C2CN(C[C@@H]2O)C(=O)[C@@H](NC(=O)[C@@H](NC(=O)C2C[C@@H](O)CN2C(=O)[C@@H](NC1=O)[C@@H](C)O)[C@H](O)[C@@H](O)c1ccc(O)cc1)[C@H](O)CCNC(=O)[C@@H](N)CCCCN)OCCN
InChI Key InChIKey=AZWUNFSPIAYYOZ-XYMYCTPNSA-N
Data  1 IC50
  Tab Delimited (TSV)   2D SDfile   Computed 3D by Vconf -m prep SDfile
Find this compound or compounds like it in BindingDB:
Activity Spreadsheet -- Enzyme Inhibition Constant Data from BindingDB
Found 1 hit for monomerid = 50289914
Target1,3-beta-glucan synthase(Candida glabrata)
TBA
Curated by ChEMBL
LigandPNGBDBM50289914(1N-[21-(2-aminoethoxy)-3-[3-(1,5-diaminopentylcarb...)
Affinity DataIC50:  3nM. Assay description: Inhibition of 1,3-beta-glucan synthase
In DepthDetails Article