BDBM50289935 3-(4-Bromo-3-methyl-isoxazol-5-ylsulfamoyl)-thiophene-2-carboxylic acid m-tolyl ester::CHEMBL291404
SMILES Cc1noc(NS(=O)(=O)c2ccsc2C(=O)Oc2cccc(C)c2)c1Br
InChI Key InChIKey=PFFISQSGKLUPSY-UHFFFAOYSA-N
Data  2 IC50
  Tab Delimited (TSV)   2D SDfile   Computed 3D by Vconf -m prep SDfile
Find this compound or compounds like it in BindingDB:
Activity Spreadsheet -- Enzyme Inhibition Constant Data from BindingDB
Found 2 hits for monomerid = 50289935
TargetEndothelin receptor type B(Homo sapiens (Human))
TBA
Curated by ChEMBL
LigandPNGBDBM50289935(3-(4-Bromo-3-methyl-isoxazol-5-ylsulfamoyl)-thioph...)
Affinity DataIC50: >1.00E+5nM. Assay description: In vitro binding affinity in a radioligand binding experiment by competition with [125I]-labeled endothelin-1 for ETB receptor
In DepthDetails Article
TargetEndothelin-1 receptor(Homo sapiens (Human))
TBA
Curated by ChEMBL
LigandPNGBDBM50289935(3-(4-Bromo-3-methyl-isoxazol-5-ylsulfamoyl)-thioph...)
Affinity DataIC50:  1.20E+3nM. Assay description: In vitro binding affinity in a radioligand binding experiment by competition with [125I]-labeled endothelin-1 for ETA receptor
In DepthDetails Article