BDBM50290289 (S)-2-[(S)-2-((S)-2-Acetylamino-4-methyl-pentanoylamino)-4-methyl-pentanoylamino]-hexanoic acid::CHEMBL314442
SMILES CCCC[C@H](NC(=O)[C@H](CC(C)C)NC(=O)[C@H](CC(C)C)NC(C)=O)C(O)=O
InChI Key InChIKey=ALMQDMPRSWZSDO-ULQDDVLXSA-N
Data  2 KI
  Tab Delimited (TSV)   2D SDfile   Computed 3D by Vconf -m prep SDfile
Find this compound or compounds like it in BindingDB:
Activity Spreadsheet -- Enzyme Inhibition Constant Data from BindingDB
Found 2 hits for monomerid = 50290289
TargetCathepsin B(Homo sapiens (Human))
TBA
Curated by ChEMBL
LigandPNGBDBM50290289((S)-2-[(S)-2-((S)-2-Acetylamino-4-methyl-pentanoyl...)
Affinity DataKi:  1nM. Assay description: Equilibrium dissociation constant of the compound for the inhibition of human cathepsin B was determined
In DepthDetails Article
TargetCalpain-1 catalytic subunit(Homo sapiens (Human))
TBA
Curated by ChEMBL
LigandPNGBDBM50290289((S)-2-[(S)-2-((S)-2-Acetylamino-4-methyl-pentanoyl...)
Affinity DataKi:  3.40nM. Assay description: Equilibrium dissociation constant of the compound for the inhibition of human Mu-calpain was determined
In DepthDetails Article