BDBM50290400 1H-Indole-2-carboxylic acid [(S)-1-(2-fluoro-phenyl)-4-oxo-3,4,6,7-tetrahydro-[1,4]diazepino[6,7,1-hi]indol-3-yl]-amide::CHEMBL300072::Pranazepide
SMILES Fc1ccccc1C1=N[C@H](NC(=O)c2cc3ccccc3[nH]2)C(=O)N2CCc3cccc1c23
InChI Key InChIKey=WKJDXKWFGJWGAS-XMMPIXPASA-N
Data  2 IC50
  Tab Delimited (TSV)   2D SDfile   Computed 3D by Vconf -m prep SDfile
Find this compound or compounds like it in BindingDB:
Activity Spreadsheet -- Enzyme Inhibition Constant Data from BindingDB
Found 2 hits for monomerid = 50290400
TargetGastrin/cholecystokinin type B receptor(Homo sapiens (Human))
TBA
Curated by ChEMBL
LigandPNGBDBM50290400(1H-Indole-2-carboxylic acid [(S)-1-(2-fluoro-pheny...)
Affinity DataIC50:  310nM. Assay description: Inhibition of [125I]-Cholecystokinin-8 binding to Cholecystokinin type B receptor of guinea pig cerebral cortical membranes
In DepthDetails Article
TargetCholecystokinin receptor type A(RAT)
TBA
Curated by ChEMBL
LigandPNGBDBM50290400(1H-Indole-2-carboxylic acid [(S)-1-(2-fluoro-pheny...)
Affinity DataIC50:  0.670nM. Assay description: Inhibition of [125I]-Cholecystokinin-8 (125I-CCK-8) binding to Cholecystokinin type A receptor of rat pancreatic membranes
In DepthDetails Article