BDBM50290517 5H-6-Oxa-12-aza-benzo[a]anthracen-7-ylamine::CHEMBL89011
SMILES Nc1c2OCc3ccccc3-c2nc2ccccc12
InChI Key InChIKey=HQDNYBNZXFEGAT-UHFFFAOYSA-N
Data  3 IC50
  Tab Delimited (TSV)   2D SDfile   Computed 3D by Vconf -m prep SDfile
Find this compound or compounds like it in BindingDB:
Activity Spreadsheet -- Enzyme Inhibition Constant Data from BindingDB
Found 3 hits for monomerid = 50290517
TargetAcetylcholinesterase(Rattus norvegicus (rat))
TBA
Curated by ChEMBL
LigandPNGBDBM50290517(5H-6-Oxa-12-aza-benzo[a]anthracen-7-ylamine | CHEM...)
Affinity DataIC50: >1.00E+5nM. Assay description: Compound was tested in vitro for inhibitory activity against Acetylcholinesterase in rat cortex
In DepthDetails Article
TargetAcetylcholinesterase(Homo sapiens (Human))
TBA
Curated by ChEMBL
LigandPNGBDBM50290517(5H-6-Oxa-12-aza-benzo[a]anthracen-7-ylamine | CHEM...)
Affinity DataIC50:  2.45E+5nM. Assay description: Compound was tested in vitro for inhibitory activity against Acetylcholinesterase
In DepthDetails Article
TargetCarboxylic ester hydrolase(Rattus norvegicus (rat))
TBA
Curated by ChEMBL
LigandPNGBDBM50290517(5H-6-Oxa-12-aza-benzo[a]anthracen-7-ylamine | CHEM...)
Affinity DataIC50:  6.58E+3nM. Assay description: Compound was tested in vitro for inhibitory activity against Butyrylcholinesterase
In DepthDetails Article