BDBM50290629 (S)-2-Pyrrolidin-2-yl-furo[3,2-b]pyridine::CHEMBL91005
SMILES C1CN[C@@H](C1)c1cc2ncccc2o1
InChI Key InChIKey=QULUBEZVAACGFX-QMMMGPOBSA-N
Data  1 EC50
  Tab Delimited (TSV)   2D SDfile   Computed 3D by Vconf -m prep SDfile
Find this compound or compounds like it in BindingDB:
Activity Spreadsheet -- Enzyme Inhibition Constant Data from BindingDB
Found 1 hit for monomerid = 50290629
TargetAcetylcholine receptor subunit alpha(Homo sapiens (Human))
TBA
Curated by ChEMBL
LigandPNGBDBM50290629((S)-2-Pyrrolidin-2-yl-furo[3,2-b]pyridine | CHEMBL...)
Affinity DataEC50: >1.00E+6nM. Assay description: Tested for functional activity against neuronal nicotinic acetylcholine receptor(nAChR) expressed in K177 cells using isotopic rubidium efflux assay.
In DepthDetails Article