BDBM50290679 4-(Amino-carboxy-methyl)-2-hydroxy-5-methyl-benzoic acid::CHEMBL329905
SMILES Cc1cc(C(O)=O)c(O)cc1C(N)C(O)=O
InChI Key InChIKey=WZDQGWVWGJQFNL-UHFFFAOYSA-N
Data  2 IC50
  Tab Delimited (TSV)   2D SDfile   Computed 3D by Vconf -m prep SDfile
Find this compound or compounds like it in BindingDB:
Activity Spreadsheet -- Enzyme Inhibition Constant Data from BindingDB
Found 2 hits for monomerid = 50290679
TargetMetabotropic glutamate receptor 5(Homo sapiens (Human))
TBA
Curated by ChEMBL
LigandPNGBDBM50290679(4-(Amino-carboxy-methyl)-2-hydroxy-5-methyl-benzoi...)
Affinity DataIC50: >3.00E+5nM. Assay description: Compound was tested for functional response of human metabotropic glutamate receptor mGluR5a expressed in AV-12 cells by measuring inhibitory concent...
In DepthDetails Article
TargetMetabotropic glutamate receptor 1(Homo sapiens (Human))
TBA
Curated by ChEMBL
LigandPNGBDBM50290679(4-(Amino-carboxy-methyl)-2-hydroxy-5-methyl-benzoi...)
Affinity DataIC50:  7.30E+4nM. Assay description: Compound was tested for functional response of human metabotropic glutamate receptor mGluR1-alpha expressed in AV-12 cells by measuring inhibitory co...
In DepthDetails Article