BDBM50290814 5-Chloro-3-morpholin-4-ylmethyl-3H-benzooxazol-2-one::CHEMBL319405
SMILES Clc1ccc2oc(=O)n(CN3CCOCC3)c2c1
InChI Key InChIKey=HUXKPGMUERDTKR-UHFFFAOYSA-N
Data  3 IC50
  Tab Delimited (TSV)   2D SDfile   Computed 3D by Vconf -m prep SDfile
Find this compound or compounds like it in BindingDB:
Activity Spreadsheet -- Enzyme Inhibition Constant Data from BindingDB
Found 3 hits for monomerid = 50290814
TargetNitric oxide synthase, brain(Homo sapiens (Human))
TBA
Curated by ChEMBL
LigandPNGBDBM50290814(5-Chloro-3-morpholin-4-ylmethyl-3H-benzooxazol-2-o...)
Affinity DataIC50:  5.60E+3nM. Assay description: Inhibitory activity against Neuronal nitric oxide synthase
In DepthDetails Article
TargetNitric oxide synthase, inducible(Homo sapiens (Human))
TBA
Curated by ChEMBL
LigandPNGBDBM50290814(5-Chloro-3-morpholin-4-ylmethyl-3H-benzooxazol-2-o...)
Affinity DataIC50:  800nM. Assay description: Inhibitory activity against Inducible nitric oxide synthase
In DepthDetails Article
TargetNitric oxide synthase, endothelial(Homo sapiens (Human))
TBA
Curated by ChEMBL
LigandPNGBDBM50290814(5-Chloro-3-morpholin-4-ylmethyl-3H-benzooxazol-2-o...)
Affinity DataIC50:  1.47E+4nM. Assay description: Inhibitory activity against Endothelial nitric oxide synthase
In DepthDetails Article