BDBM50290840 4-(2,3-Dimethoxy-phenoxy)-6,7-dimethoxy-quinoline::CHEMBL98155
SMILES COc1cc2nccc(Oc3cccc(OC)c3OC)c2cc1OC
InChI Key InChIKey=NQWDTJUCVNPURX-UHFFFAOYSA-N
Data  1 IC50
  Tab Delimited (TSV)   2D SDfile   Computed 3D by Vconf -m prep SDfile
Find this compound or compounds like it in BindingDB:
Activity Spreadsheet -- Enzyme Inhibition Constant Data from BindingDB
Found 1 hit for monomerid = 50290840
TargetPlatelet-derived growth factor receptor beta(Rattus norvegicus)
TBA
Curated by ChEMBL
LigandPNGBDBM50290840(4-(2,3-Dimethoxy-phenoxy)-6,7-dimethoxy-quinoline ...)
Affinity DataIC50:  4.40E+3nM. Assay description: Inhibition of PDGF-BB induced PDGF-B receptor autophosphorylation in rat mesangial cells.
In DepthDetails Article