BDBM50290847 6,7-Dimethoxy-4-(3-methoxy-phenoxy)-quinoline::CHEMBL98583
SMILES COc1cccc(Oc2ccnc3cc(OC)c(OC)cc23)c1
InChI Key InChIKey=SORFICSDHDADIC-UHFFFAOYSA-N
Data  1 IC50
  Tab Delimited (TSV)   2D SDfile   Computed 3D by Vconf -m prep SDfile
Find this compound or compounds like it in BindingDB:
Activity Spreadsheet -- Enzyme Inhibition Constant Data from BindingDB
Found 1 hit for monomerid = 50290847
TargetPlatelet-derived growth factor receptor beta(Rattus norvegicus)
TBA
Curated by ChEMBL
LigandPNGBDBM50290847(6,7-Dimethoxy-4-(3-methoxy-phenoxy)-quinoline | CH...)
Affinity DataIC50:  440nM. Assay description: Inhibition of PDGF-BB induced PDGF-B receptor autophosphorylation in rat mesangial cells.
In DepthDetails Article