BDBM50290919 4-(4-Methoxy-phenyl)-piperazine-1-carboxylic acid [4-methoxy-3-(4-methyl-piperazin-1-yl)-phenyl]-amide; compound with (E)-but-2-enedioic acid::CHEMBL108645
SMILES COc1ccc(cc1)N1CCN(CC1)C(=O)Nc1ccc(OC)c(c1)N1CCN(C)CC1
InChI Key InChIKey=HCTBJYWMGCQPOS-UHFFFAOYSA-N
Data  3 KI
  Tab Delimited (TSV)   2D SDfile   Computed 3D by Vconf -m prep SDfile
Find this compound or compounds like it in BindingDB:
Activity Spreadsheet -- Enzyme Inhibition Constant Data from BindingDB
Found 3 hits for monomerid = 50290919
Target5-hydroxytryptamine receptor 1B(Homo sapiens (Human))
TBA
Curated by ChEMBL
LigandPNGBDBM50290919(4-(4-Methoxy-phenyl)-piperazine-1-carboxylic acid ...)
Affinity DataKi:  8.40nM. Assay description: Affinity for 5-hydroxytryptamine 1B receptor subtype
In DepthDetails Article
Target5-hydroxytryptamine receptor 1D(Homo sapiens (Human))
TBA
Curated by ChEMBL
LigandPNGBDBM50290919(4-(4-Methoxy-phenyl)-piperazine-1-carboxylic acid ...)
Affinity DataKi:  230nM. Assay description: Affinity for 5-hydroxytryptamine 1D receptor subtype
In DepthDetails Article
Target5-hydroxytryptamine receptor 1A(Homo sapiens (Human))
TBA
Curated by ChEMBL
LigandPNGBDBM50290919(4-(4-Methoxy-phenyl)-piperazine-1-carboxylic acid ...)
Affinity DataKi:  1.00E+3nM. Assay description: Affinity for 5-hydroxytryptamine 1A receptor subtype
In DepthDetails Article