BDBM50291061 1-Methyl-1H-imidazole-2-sulfonic acid (3-{cyclopropyl-[6-(2-cyclopropyl-1-cyclopropylmethyl-ethyl)-4-hydroxy-2-oxo-2H-pyran-3-yl]-methyl}-phenyl)-amide::CHEMBL128629
SMILES Cn1ccnc1S(=O)(=O)Nc1cccc(c1)C(C1CC1)c1c(O)cc(oc1=O)C(CC1CC1)CC1CC1
InChI Key InChIKey=XDASXYHIYMOGQE-UHFFFAOYSA-N
Data  1 KI
  Tab Delimited (TSV)   2D SDfile   Computed 3D by Vconf -m prep SDfile
Find this compound or compounds like it in BindingDB:
Activity Spreadsheet -- Enzyme Inhibition Constant Data from BindingDB
Found 1 hit for monomerid = 50291061
TargetGag-Pol polyprotein [489-587](Human immunodeficiency virus type 1)
TBA
Curated by ChEMBL
LigandPNGBDBM50291061(1-Methyl-1H-imidazole-2-sulfonic acid (3-{cyclopro...)
Affinity DataKi:  0.730nM. Assay description: Inhibition of HIV-1 protease.
In DepthDetails Article