BDBM50291210 CHEMBL150330::[(S)-3-Carbamoyl-1-((S)-1-formyl-3-methyl-butylcarbamoyl)-propyl]-carbamic acid benzyl ester
SMILES CC(C)C[C@H](NC(=O)[C@H](CCC(N)=O)NC(=O)OCc1ccccc1)C=O
InChI Key InChIKey=DUFSZGFDAIYERQ-HOTGVXAUSA-N
Data  1 IC50
  Tab Delimited (TSV)   2D SDfile   Computed 3D by Vconf -m prep SDfile
Find this compound or compounds like it in BindingDB:
Activity Spreadsheet -- Enzyme Inhibition Constant Data from BindingDB
Found 1 hit for monomerid = 50291210
TargetCalpain-1 catalytic subunit(Homo sapiens (Human))
TBA
Curated by ChEMBL
LigandPNGBDBM50291210(CHEMBL150330 | [(S)-3-Carbamoyl-1-((S)-1-formyl-3-...)
Affinity DataIC50:  370nM. Assay description: Inhibitory activity evaluated against recombinant human calpain 1
In DepthDetails Article