BDBM50291309 CHEMBL3215427::CHEMBL446630::sialyl Lewis Analog
SMILES C[C@@H]1O[C@@H](O[C@@H]2[C@H](NC(C)=O)[C@H](OCCCCCCN)O[C@@H](CO)[C@H]2O[C@@H]2O[C@@H](CO)[C@H](O)[C@H](O[C@@]3(C[C@@H](O)C[C@@H](O3)[C@H](O)[C@H](O)CO)C(O)=O)[C@@H]2O)[C@@H](O)[C@@H](O)[C@@H]1O
InChI Key InChIKey=IGKIQCSAOBOYMT-OIWQLURSSA-N
Data  2 IC50
  Tab Delimited (TSV)   2D SDfile   Computed 3D by Vconf -m prep SDfile
Find this compound or compounds like it in BindingDB:
Activity Spreadsheet -- Enzyme Inhibition Constant Data from BindingDB
Found 2 hits for monomerid = 50291309
TargetE-selectin(Homo sapiens (Human))
TBA
Curated by ChEMBL
LigandPNGBDBM50291309(CHEMBL3215427 | CHEMBL446630 | sialyl Lewis Analog)
Affinity DataIC50:  7.00E+5nM. Assay description: Tested for its ability to inhibit HL60 cell adhesion to Selectin E IgG fusion proteins
In DepthDetails Article
TargetP-selectin(Homo sapiens (Human))
TBA
Curated by ChEMBL
LigandPNGBDBM50291309(CHEMBL3215427 | CHEMBL446630 | sialyl Lewis Analog)
Affinity DataIC50:  7.00E+5nM. Assay description: Tested for its ability to inhibit HL60 cell adhesion to P-selectin-IgG fusion proteins
In DepthDetails Article