BDBM50291320 (2R,4R)-4-Benzoylamino-pyrrolidine-2,4-dicarboxylic acid::CHEMBL345381
SMILES OC(=O)[C@H]1C[C@](CN1)(NC(=O)c1ccccc1)C(O)=O
InChI Key InChIKey=LAXVMLWOVAZJEG-NOZJJQNGSA-N
Data  1 EC50
  Tab Delimited (TSV)   2D SDfile   Computed 3D by Vconf -m prep SDfile
Find this compound or compounds like it in BindingDB:
Activity Spreadsheet -- Enzyme Inhibition Constant Data from BindingDB
Found 1 hit for monomerid = 50291320
TargetMetabotropic glutamate receptor 6(Rattus norvegicus (Rat))
TBA
Curated by ChEMBL
LigandPNGBDBM50291320((2R,4R)-4-Benzoylamino-pyrrolidine-2,4-dicarboxyli...)
Affinity DataEC50:  1.00E+6nM. Assay description: Tested for the agonistic activity against Metabotropic glutamate receptor 6
In DepthDetails Article