BDBM50291426 (R)-2-((R)-2-Benzyloxycarbonylamino-1-cyano-3-(S)-1H-indol-3-yl-propylamino)-N-(1-carbamoyl-2-phenyl-ethyl)-succinamic acid::CHEMBL367057
SMILES NC(=O)C(Cc1ccccc1)NC(=O)C[C@@H](N[C@@H](C#N)[C@H](Cc1c[nH]c2ccccc12)NC(=O)OCc1ccccc1)C(O)=O
InChI Key InChIKey=WSOLHUNINFVSHC-ZNBPAQNLSA-N
Data  2 IC50
  Tab Delimited (TSV)   2D SDfile   Computed 3D by Vconf -m prep SDfile
Find this compound or compounds like it in BindingDB:
Activity Spreadsheet -- Enzyme Inhibition Constant Data from BindingDB
Found 2 hits for monomerid = 50291426
LigandPNGBDBM50291426((R)-2-((R)-2-Benzyloxycarbonylamino-1-cyano-3-(S)-...)
Affinity DataIC50:  8.63E+3nM. Assay description: Inhibition of specific [3H]propionyl-CCK-8 binding to rat cerebral cortex membrane Cholecystokinin type B receptor
In DepthDetails Article
TargetCholecystokinin receptor type A(RAT)
TBA
Curated by ChEMBL
LigandPNGBDBM50291426((R)-2-((R)-2-Benzyloxycarbonylamino-1-cyano-3-(S)-...)
Affinity DataIC50:  272nM. Assay description: Inhibition of specific [3H]propionyl-CCK-8 binding to rat pancreas membrane Cholecystokinin type A receptor
In DepthDetails Article