BDBM50291695 CHEMBL84822::H-PHOSPHONATE DERIVATIVE
SMILES CCCC[C@H](OP(O)=O)C(=O)N[C@@H](CC(C)C)C(=O)Nc1ccc(cc1)[N+]([O-])=O
InChI Key InChIKey=PPHMVRBCABAKLJ-HOTGVXAUSA-N
Data  1 KI
  Tab Delimited (TSV)   2D SDfile   Computed 3D by Vconf -m prep SDfile
Find this compound or compounds like it in BindingDB:
Activity Spreadsheet -- Enzyme Inhibition Constant Data from BindingDB
Found 1 hit for monomerid = 50291695
TargetPeptide deformylase(Escherichia coli (strain K12))
Ohio State University
Curated by ChEMBL
LigandPNGBDBM50291695(CHEMBL84822 | H-PHOSPHONATE DERIVATIVE)
Affinity DataKi:  3.70E+4nM. Assay description: Compound was evaluated for inhibitory activity against Peptide deformylase
In DepthDetails ArticlePubMed