BDBM50291738 CHEMBL4166067
SMILES Cc1c(N2CCN(Cc3ccc(o3)C(F)(F)F)CC2)c(=O)n(C[C@H](N)c2ccccc2O)c(=O)n1Cc1c(F)cccc1F
InChI Key InChIKey=BMEQCDDEUXUOFQ-DEOSSOPVSA-N
Data  1 IC50
  Tab Delimited (TSV)   2D SDfile   Computed 3D by Vconf -m prep SDfile
Find this compound or compounds like it in BindingDB:
Activity Spreadsheet -- Enzyme Inhibition Constant Data from BindingDB
Found 1 hit for monomerid = 50291738
TargetGonadotropin-releasing hormone receptor(Homo sapiens (Human))
Tiumbio
Curated by ChEMBL
LigandPNGBDBM50291738(CHEMBL4166067)
Affinity DataIC50:  15nM. Assay description: Antagonist activity at human GnRH receptor expressed in HEK293 cells co-expressing pGL4-NFATpromoter AP-1-luc assessed as inhibition of GnRH-induced ...
In DepthDetails ArticlePubMed