BDBM50292023 CHEMBL1795060::CHEMBL35495::{(2-{Carboxymethyl-[(3-methyl-5-sulfamoyl-3H-[1,3,4]thiadiazol-2-ylidenecarbamoyl)-methyl]-amino}-ethyl)-[(3-methyl-5-sulfamoyl-3H-[1,3,4]thiadiazol-2-ylidenecarbamoyl)-methyl]-amino}-acetic acid::{(2-{Carboxymethyl-[(3-methyl-5-sulfamoyl-3H-[1,3,4]thiadiazol-2-ylidenecarbamoyl)-methyl]-amino}-ethyl)-[(3-methyl-5-sulfamoyl-3H-[1,3,4]thiadiazol-2-ylidenecarbamoyl)-methyl]-amino}-acetic acid; compound with Zn complex
SMILES Cn1nc(sc1=NC(=O)CN(CCN(CC(O)=O)CC(=O)N=c1sc(nn1C)S(N)(=O)=O)CC(O)=O)S(N)(=O)=O
InChI Key InChIKey=ODWSOTDOGQCHBR-UHFFFAOYSA-N
Data  6 KI
  Tab Delimited (TSV)   2D SDfile   Computed 3D by Vconf -m prep SDfile
Find this compound or compounds like it in BindingDB:
Activity Spreadsheet -- Enzyme Inhibition Constant Data from BindingDB
Found 6 hits for monomerid = 50292023
TargetCarbonic anhydrase 2(Homo sapiens (Human))
Universit£
Curated by ChEMBL
LigandPNGBDBM50292023(CHEMBL1795060 | CHEMBL35495 | {(2-{Carboxymethyl-[...)
Affinity DataKi:  0.700nM. Assay description: Inhibitory activity against Human carbonic anhydrase II
In DepthDetails ArticlePubMed
TargetCarbonic anhydrase 2(Homo sapiens (Human))
Universit£
Curated by ChEMBL
LigandPNGBDBM50292023(CHEMBL1795060 | CHEMBL35495 | {(2-{Carboxymethyl-[...)
Affinity DataKi:  7nM. Assay description: Inhibitory activity against Human carbonic anhydrase II
In DepthDetails ArticlePubMed
TargetCarbonic anhydrase 4(Bos taurus (bovine))
Universit£
Curated by ChEMBL
LigandPNGBDBM50292023(CHEMBL1795060 | CHEMBL35495 | {(2-{Carboxymethyl-[...)
Affinity DataKi:  8nM. Assay description: Inhibitory activity against bovine carbonic anhydrase IV
In DepthDetails ArticlePubMed
TargetCarbonic anhydrase 4(Bos taurus (bovine))
Universit£
Curated by ChEMBL
LigandPNGBDBM50292023(CHEMBL1795060 | CHEMBL35495 | {(2-{Carboxymethyl-[...)
Affinity DataKi:  17nM. Assay description: Inhibitory activity against bovine carbonic anhydrase IV
In DepthDetails ArticlePubMed
TargetCarbonic anhydrase 1(Homo sapiens (Human))
Universit£
Curated by ChEMBL
LigandPNGBDBM50292023(CHEMBL1795060 | CHEMBL35495 | {(2-{Carboxymethyl-[...)
Affinity DataKi:  40nM. Assay description: Inhibitory activity against Human carbonic anhydrase I
In DepthDetails ArticlePubMed
TargetCarbonic anhydrase 1(Homo sapiens (Human))
Universit£
Curated by ChEMBL
LigandPNGBDBM50292023(CHEMBL1795060 | CHEMBL35495 | {(2-{Carboxymethyl-[...)
Affinity DataKi:  105nM. Assay description: Inhibitory activity against Human carbonic anhydrase I
In DepthDetails ArticlePubMed