BDBM50292170 1-[5-(2,4-Dimethoxy-phenyl)-3-(4-hydroxy-phenyl)-4,5-dihydro-pyrazol-1-yl]-ethanone::CHEMBL65252
SMILES COc1ccc(C2CC(=NN2C(C)=O)c2ccc(O)cc2)c(OC)c1
InChI Key InChIKey=IAFZMTVQDVELPN-UHFFFAOYSA-N
Data  2 IC50
  Tab Delimited (TSV)   2D SDfile   Computed 3D by Vconf -m prep SDfile
Find this compound or compounds like it in BindingDB:
Activity Spreadsheet -- Enzyme Inhibition Constant Data from BindingDB
Found 2 hits for monomerid = 50292170
TargetAmine oxidase [flavin-containing] B(Homo sapiens (Human))
Sapienza University Of Rome
Curated by ChEMBL
LigandPNGBDBM50292170(1-[5-(2,4-Dimethoxy-phenyl)-3-(4-hydroxy-phenyl)-4...)
Affinity DataIC50:  2.00E+4nM. Assay description: Inhibition of human monoamine oxidase B
In DepthDetails ArticlePubMed
TargetAmine oxidase [flavin-containing] A(Homo sapiens (Human))
Sapienza University Of Rome
Curated by ChEMBL
LigandPNGBDBM50292170(1-[5-(2,4-Dimethoxy-phenyl)-3-(4-hydroxy-phenyl)-4...)
Affinity DataIC50:  10nM. Assay description: Inhibition of human monoamine oxidase A
In DepthDetails ArticlePubMed