BDBM50292479 1-(3,4-dimethoxybenzylidene)-2-phenylhydrazine::CHEMBL443706
SMILES COc1ccc(CN=Nc2ccccc2)cc1OC
InChI Key InChIKey=DIMAVDXIYBFTFQ-UHFFFAOYSA-N
Data  1 IC50
  Tab Delimited (TSV)   2D SDfile   Computed 3D by Vconf -m prep SDfile
Find this compound or compounds like it in BindingDB:
Activity Spreadsheet -- Enzyme Inhibition Constant Data from BindingDB
Found 1 hit for monomerid = 50292479
TargetTyrosine-protein kinase Lck(Homo sapiens (Human))
TBA
Curated by ChEMBL
LigandPNGBDBM50292479(1-(3,4-dimethoxybenzylidene)-2-phenylhydrazine | C...)
Affinity DataIC50:  7.00E+4nM. Assay description: Inhibition of p56 lck
In DepthDetails ArticlePubMed