BDBM50292557 (S,R)-pseudoxandrine hydrochloride::CHEMBL504303
SMILES COc1cc2CCN(C)[C@H]3c2c(Oc2cc4[C@@H](Cc5ccc(OC)c(c5)-c5cc(ccc5O)C3=O)N(C)CCc4cc2OC)c1O
InChI Key InChIKey=RUAKOEPLVVXTGN-YJNPBZNESA-N
Data  2 IC50
  Tab Delimited (TSV)   2D SDfile   Computed 3D by Vconf -m prep SDfile
Find this compound or compounds like it in BindingDB:
Activity Spreadsheet -- Enzyme Inhibition Constant Data from BindingDB
Found 2 hits for monomerid = 50292557
TargetD(2) dopamine receptor(Rattus norvegicus (rat))
TBA
Curated by ChEMBL
LigandPNGBDBM50292557((S,R)-pseudoxandrine hydrochloride | CHEMBL504303)
Affinity DataIC50:  1.62E+4nM. Assay description: Displacement of [3H]raclopride from dopamine D2 receptor in Wistar rat striatal membrane by liquid scintillation counting
In DepthDetails ArticlePubMed
TargetD(1A) dopamine receptor(RAT)
TBA
Curated by ChEMBL
LigandPNGBDBM50292557((S,R)-pseudoxandrine hydrochloride | CHEMBL504303)
Affinity DataIC50:  9.02E+4nM. Assay description: Displacement of [3H]SCH23390 from dopamine D1 receptor in Wistar rat striatal membrane by liquid scintillation counting
In DepthDetails ArticlePubMed