BDBM50292572 3,3-dimethylbutan-2-yl methylphosphonofluoridate::CHEMBL15910::SOMAN
SMILES CC(OP(C)(F)=O)C(C)(C)C
InChI Key InChIKey=GRXKLBBBQUKJJZ-UHFFFAOYSA-N
Data  2 Kd
  Tab Delimited (TSV)   2D SDfile   Computed 3D by Vconf -m prep SDfile
Find this compound or compounds like it in BindingDB:
Activity Spreadsheet -- Enzyme Inhibition Constant Data from BindingDB
Found 2 hits for monomerid = 50292572
TargetAcetylcholinesterase(Electrophorus electricus (Electric eel))
University Of Missouri St. Louis
Curated by ChEMBL
LigandPNGBDBM50292572(3,3-dimethylbutan-2-yl methylphosphonofluoridate |...)
Affinity DataKd:  400nM. Assay description: Binding affinity against adenosine A1 receptor from rat brain membranes using [3H]cyclohexyladenosine as radioligand.
In DepthDetails ArticlePubMed
TargetAcetylcholinesterase(Electrophorus electricus (Electric eel))
University Of Missouri St. Louis
Curated by ChEMBL
LigandPNGBDBM50292572(3,3-dimethylbutan-2-yl methylphosphonofluoridate |...)
Affinity DataKd:  610nM. Assay description: Binding affinity to electric eel AChE
In DepthDetails ArticlePubMed