BDBM50292668 (+/-)-1-(1'-(4-bromobenzyl)-3-phenyl-3,4'-bipiperidin-1-yl)-2,2,2-trifluoroethanone::CHEMBL496171
SMILES FC(F)(F)C(=O)N1CCCC(C1)(C1CCN(Cc2ccc(Br)cc2)CC1)c1ccccc1
InChI Key InChIKey=KLGLMVXXCWGYNY-UHFFFAOYSA-N
Data  1 IC50
  Tab Delimited (TSV)   2D SDfile   Computed 3D by Vconf -m prep SDfile
Find this compound or compounds like it in BindingDB:
Activity Spreadsheet -- Enzyme Inhibition Constant Data from BindingDB
Found 1 hit for monomerid = 50292668
TargetC-X-C chemokine receptor type 3(Homo sapiens (Human))
Johnson & Johnson Prd
Curated by ChEMBL
LigandPNGBDBM50292668((+/-)-1-(1'-(4-bromobenzyl)-3-phenyl-3,4'-bipiperi...)
Affinity DataIC50:  690nM. Assay description: Antagonist activity at human CXCR3 expressed in CHO cells assessed as inhibition of ITAC-stimulated [35S]GTPgammaS binding pretreated 30 mins before ...
In DepthDetails ArticlePubMed