BDBM50292721 CHEMBL504858::[({[(2R,3S,4R,5R)-5-(6-amino-9H-purin-9-yl)-4-hydroxy-2-(hydroxymethyl)oxolan-3-yl]oxy}(hydroxy)phosphoryl)oxy]({[(2R,3S,5R)-3-hydroxy-5-(5-methyl-2,4-dioxo-1,2,3,4-tetrahydropyrimidin-1-yl)oxolan-2-yl]methoxy})phosphinic acid
SMILES Cc1cn([C@H]2C[C@H](OP(O)(=O)OP(O)(=O)OC[C@H]3O[C@H]([C@H](O)[C@@H]3OP(O)(O)=O)n3cnc4c(N)ncnc34)[C@@H](COP(O)(O)=O)O2)c(=O)[nH]c1=O
InChI Key InChIKey=DQGQNMNTNSHMMC-SLFMBYJQSA-N
Data  1 KI
  Tab Delimited (TSV)   2D SDfile   Computed 3D by Vconf -m prep SDfile
Find this compound or compounds like it in BindingDB:
Activity Spreadsheet -- Enzyme Inhibition Constant Data from BindingDB
Found 1 hit for monomerid = 50292721
TargetRibonuclease pancreatic(Bison bison (American bison))
Institute Of Technology
Curated by ChEMBL
LigandPNGBDBM50292721(CHEMBL504858 | [({[(2R,3S,4R,5R)-5-(6-amino-9H-pur...)
Affinity DataKi:  41nM. Assay description: Inhibition of bovine pancreatic RNase A by spectrophotometric method
In DepthDetails ArticlePubMedMMDB