BDBM50292726 1-benzyl-5-((5-chloro-2-hydroxyphenylamino)methylene)-4-methyl-2,6-dioxo-1,2,5,6-tetrahydropyridine-3-carbonitrile::CHEMBL473533
SMILES CC1=C(C#N)C(=O)N(Cc2ccccc2)C(=O)C1=CNc1cc(Cl)ccc1O
InChI Key InChIKey=PQHTVDQCYGKSDR-UHFFFAOYSA-N
Data  2 IC50
  Tab Delimited (TSV)   2D SDfile   Computed 3D by Vconf -m prep SDfile
Find this compound or compounds like it in BindingDB:
Activity Spreadsheet -- Enzyme Inhibition Constant Data from BindingDB
Found 2 hits for monomerid = 50292726
TargetHepatocyte growth factor receptor(Homo sapiens (Human))
National Cancer Institute-Frederick
Curated by ChEMBL
LigandPNGBDBM50292726(1-benzyl-5-((5-chloro-2-hydroxyphenylamino)methyle...)
Affinity DataIC50:  5.00E+4nM. Assay description: Inhibition of Met in HGF-stimulated human B5/589 cells by electrochemiluminescent two-site immunoassay
In DepthDetails ArticlePubMed
TargetHepatocyte growth factor receptor(Homo sapiens (Human))
National Cancer Institute-Frederick
Curated by ChEMBL
LigandPNGBDBM50292726(1-benzyl-5-((5-chloro-2-hydroxyphenylamino)methyle...)
Affinity DataIC50:  4.30E+4nM. Assay description: Inhibition of human Met by electrochemiluminescent two-site immunoassay
In DepthDetails ArticlePubMed