BDBM50292998 2-Amino-4-(4-methoxyphenyl)-7-(3,4-dimethoxyphenyl)-5-oxo-5,6,7,8-tetrahydro-4H-chromene-3-carbonitrile::CHEMBL516213
SMILES COc1ccc(cc1)C1C(C#N)C(=N)OC2=C1C(=O)CC(C2)c1ccc(OC)c(OC)c1
InChI Key InChIKey=LXODZJXZYHWGBU-UHFFFAOYSA-N
Data  3 IC50
  Tab Delimited (TSV)   2D SDfile   Computed 3D by Vconf -m prep SDfile
Find this compound or compounds like it in BindingDB:
Activity Spreadsheet -- Enzyme Inhibition Constant Data from BindingDB
Found 3 hits for monomerid = 50292998
TargetExcitatory amino acid transporter 1(Homo sapiens (Human))
University Of Copenhagen
Curated by ChEMBL
LigandPNGBDBM50292998(2-Amino-4-(4-methoxyphenyl)-7-(3,4-dimethoxyphenyl...)
Affinity DataIC50:  1.10E+4nM. Assay description: Displacement of [3H]D-Asp from human EAAT1 receptor expressed in HEK293 cells
In DepthDetails ArticlePubMed
TargetExcitatory amino acid transporter 3(Homo sapiens (Human))
University Of Copenhagen
Curated by ChEMBL
LigandPNGBDBM50292998(2-Amino-4-(4-methoxyphenyl)-7-(3,4-dimethoxyphenyl...)
Affinity DataIC50: >3.00E+5nM. Assay description: Displacement of [3H]D-Asp from human EAAT3 receptor expressed in HEK293 cells
In DepthDetails ArticlePubMed
TargetExcitatory amino acid transporter 2(Homo sapiens (Human))
University Of Copenhagen
Curated by ChEMBL
LigandPNGBDBM50292998(2-Amino-4-(4-methoxyphenyl)-7-(3,4-dimethoxyphenyl...)
Affinity DataIC50: >3.00E+5nM. Assay description: Displacement of [3H]D-Asp from human EAAT2 receptor expressed in HEK293 cells
In DepthDetails ArticlePubMed