BDBM50293002 2-amino-4-(naphthalen-2-yl)-5-oxo-7-phenyl-5,6,7,8-tetrahydro-4H-chromene-3-carbonitrile::CHEMBL515558
SMILES N=C1OC2=C(C(C1C#N)c1ccc3ccccc3c1)C(=O)CC(C2)c1ccccc1
InChI Key InChIKey=NXQYDNYPQWGWCT-UHFFFAOYSA-N
Data  3 IC50
  Tab Delimited (TSV)   2D SDfile   Computed 3D by Vconf -m prep SDfile
Find this compound or compounds like it in BindingDB:
Activity Spreadsheet -- Enzyme Inhibition Constant Data from BindingDB
Found 3 hits for monomerid = 50293002
TargetExcitatory amino acid transporter 1(Homo sapiens (Human))
University Of Copenhagen
Curated by ChEMBL
LigandPNGBDBM50293002(2-amino-4-(naphthalen-2-yl)-5-oxo-7-phenyl-5,6,7,8...)
Affinity DataIC50:  3.60E+3nM. Assay description: Displacement of [3H]D-Asp from human EAAT1 receptor expressed in HEK293 cells
In DepthDetails ArticlePubMed
TargetExcitatory amino acid transporter 3(Homo sapiens (Human))
University Of Copenhagen
Curated by ChEMBL
LigandPNGBDBM50293002(2-amino-4-(naphthalen-2-yl)-5-oxo-7-phenyl-5,6,7,8...)
Affinity DataIC50: >1.00E+5nM. Assay description: Displacement of [3H]D-Asp from human EAAT3 receptor expressed in HEK293 cells
In DepthDetails ArticlePubMed
TargetExcitatory amino acid transporter 2(Homo sapiens (Human))
University Of Copenhagen
Curated by ChEMBL
LigandPNGBDBM50293002(2-amino-4-(naphthalen-2-yl)-5-oxo-7-phenyl-5,6,7,8...)
Affinity DataIC50: >1.00E+5nM. Assay description: Displacement of [3H]D-Asp from human EAAT2 receptor expressed in HEK293 cells
In DepthDetails ArticlePubMed