BDBM50293061 2-Amino-7-({[1,3-dihydroxy-2-(hydroxymethyl)propan-2-yl]amino}methyl)-3,5-dihydro-4H-pyrrolo[3,2-d]pyrimidin-4-one::CHEMBL489690
SMILES Nc1nc2c(CNC(CO)(CO)CO)c[nH]c2c(=O)[nH]1
InChI Key InChIKey=YXWHDKUITLTJIT-UHFFFAOYSA-N
Data  1 KI
  Tab Delimited (TSV)   2D SDfile   Computed 3D by Vconf -m prep SDfile
Find this compound or compounds like it in BindingDB:
Activity Spreadsheet -- Enzyme Inhibition Constant Data from BindingDB
Found 1 hit for monomerid = 50293061
TargetPurine nucleoside phosphorylase(Homo sapiens (Human))
Industrial Research
Curated by ChEMBL
LigandPNGBDBM50293061(2-Amino-7-({[1,3-dihydroxy-2-(hydroxymethyl)propan...)
Affinity DataKi:  0.400nM. Assay description: Inhibition of human PNP by xanthine-oxidase coupled assay
In DepthDetails ArticlePubMed