BDBM50293312 CHEMBL562089::N-(4-(2-morpholinoacetamido)phenethyl)-2-(4-fluorophenyl)-7-hydroxy-1H-benzo[d]imidazole-4-carboxamide
SMILES Oc1ccc(C(=O)NCCc2ccc(NC(=O)CN3CCOCC3)cc2)c2[nH]c(nc12)-c1ccc(F)cc1
InChI Key InChIKey=PQZZKQYERRCWBV-UHFFFAOYSA-N
Data  1 IC50
  Tab Delimited (TSV)   2D SDfile   Computed 3D by Vconf -m prep SDfile
Find this compound or compounds like it in BindingDB:
Activity Spreadsheet -- Enzyme Inhibition Constant Data from BindingDB
Found 1 hit for monomerid = 50293312
TargetGlycogen synthase kinase-3 beta(Homo sapiens (Human))
Sterling Road
Curated by ChEMBL
LigandPNGBDBM50293312(CHEMBL562089 | N-(4-(2-morpholinoacetamido)pheneth...)
Affinity DataIC50:  40nM. Assay description: Inhibition of human GSK3beta
In DepthDetails ArticlePubMed