BDBM50293397 2-[(3S)-3-[Benzylsulfonylamino]-4-oxo-7-phenyl-3,4-dihydro-1,5-benzothiazepin-5(2H)-yl]-N-{4-[amino(imino)methyl]benzyl}-acetamide, trifluoroacetate::CHEMBL554542
SMILES NC(=N)c1ccc(CNC(=O)CN2c3cc(ccc3SC[C@@H](NS(=O)(=O)Cc3ccccc3)C2=O)-c2ccccc2)cc1
InChI Key InChIKey=DLVPSTQDDIDTRE-HHHXNRCGSA-N
Data  1 IC50
  Tab Delimited (TSV)   2D SDfile   Computed 3D by Vconf -m prep SDfile
Find this compound or compounds like it in BindingDB:
Activity Spreadsheet -- Enzyme Inhibition Constant Data from BindingDB
Found 1 hit for monomerid = 50293397
TargetTissue factor(Homo sapiens (Human))
University Of Montpellier
Curated by ChEMBL
LigandPNGBDBM50293397(2-[(3S)-3-[Benzylsulfonylamino]-4-oxo-7-phenyl-3,4...)
Affinity DataIC50:  1.09E+4nM. Assay description: Inhibition of human tissue factor/factor 7a
In DepthDetails ArticlePubMed