BDBM50293425 (S)-4'-(2-{[2-Hydroxy-3-(4-hydroxyphenoxy)propyl]amino}ethyl)-2-(indol-3-yl)acetanilide::CHEMBL552434
SMILES O[C@@H](CNCCc1ccc(NC(=O)Cc2c[nH]c3ccccc23)cc1)COc1ccc(O)cc1
InChI Key InChIKey=FROAXINFEPJYHT-QHCPKHFHSA-N
Data  3 EC50
  Tab Delimited (TSV)   2D SDfile   Computed 3D by Vconf -m prep SDfile
Find this compound or compounds like it in BindingDB:
Activity Spreadsheet -- Enzyme Inhibition Constant Data from BindingDB
Found 3 hits for monomerid = 50293425
TargetBeta-2 adrenergic receptor(Homo sapiens (Human))
Astellas Pharma
Curated by ChEMBL
LigandPNGBDBM50293425((S)-4'-(2-{[2-Hydroxy-3-(4-hydroxyphenoxy)propyl]a...)
Affinity DataEC50: >1.00E+5nM. Assay description: Agonist activity at human cloned adrenergic beta2 receptor expressed in CHO cells assessed as increase in cAMP production after 2 days by radioimmuno...
In DepthDetails ArticlePubMed
TargetBeta-3 adrenergic receptor(Homo sapiens (Human))
Astellas Pharma
Curated by ChEMBL
LigandPNGBDBM50293425((S)-4'-(2-{[2-Hydroxy-3-(4-hydroxyphenoxy)propyl]a...)
Affinity DataEC50:  490nM. Assay description: Agonist activity at human cloned adrenergic beta3 receptor expressed in CHO cells assessed as increase in cAMP production after 2 days by radioimmuno...
In DepthDetails ArticlePubMed
TargetBeta-1 adrenergic receptor(Homo sapiens (Human))
Astellas Pharma
Curated by ChEMBL
LigandPNGBDBM50293425((S)-4'-(2-{[2-Hydroxy-3-(4-hydroxyphenoxy)propyl]a...)
Affinity DataEC50:  550nM. Assay description: Agonist activity at human cloned adrenergic beta-1 receptor expressed in CHO cells assessed as increase in cAMP production after 2 days by radioimmun...
In DepthDetails ArticlePubMed