BDBM50293447 CHEMBL549935::N,N-diethyl-N-methyl-3-(7-oxo-7H-dibenzo[de,g]quinoline-4-carboxamido)propan-1-aminium iodide
SMILES CC[N+](C)(CC)CCCNC(=O)c1cnc2C(=O)c3ccccc3-c3cccc1c23
InChI Key InChIKey=PMGNTUDELMPHHT-UHFFFAOYSA-O
Data  2 IC50
  Tab Delimited (TSV)   2D SDfile   Computed 3D by Vconf -m prep SDfile
Find this compound or compounds like it in BindingDB:
Activity Spreadsheet -- Enzyme Inhibition Constant Data from BindingDB
Found 2 hits for monomerid = 50293447
TargetCholinesterase(Equus caballus (Horse))
Sun Yat-Sen University
Curated by ChEMBL
LigandPNGBDBM50293447(CHEMBL549935 | N,N-diethyl-N-methyl-3-(7-oxo-7H-di...)
Affinity DataIC50:  9.72E+3nM. Assay description: Inhibition of equine serum BuChE by Ellman's method
In DepthDetails ArticlePubMed
TargetAcetylcholinesterase(Electrophorus electricus (Electric eel))
Sun Yat-Sen University
Curated by ChEMBL
LigandPNGBDBM50293447(CHEMBL549935 | N,N-diethyl-N-methyl-3-(7-oxo-7H-di...)
Affinity DataIC50:  650nM. Assay description: Inhibition of electric eel AChE by Ellman's method
In DepthDetails ArticlePubMed