BDBM50293505 2-(4-(N-(4-butylbenzyl)methylsulfonamido)butoxy)acetic acid::CHEMBL559561
SMILES CCCCc1ccc(CN(CCCCOCC(O)=O)S(C)(=O)=O)cc1
InChI Key InChIKey=LEMTUKURILRYMX-UHFFFAOYSA-N
Data  2 IC50  1 EC50
  Tab Delimited (TSV)   2D SDfile   Computed 3D by Vconf -m prep SDfile
Find this compound or compounds like it in BindingDB:
Activity Spreadsheet -- Enzyme Inhibition Constant Data from BindingDB
Found 3 hits for monomerid = 50293505
TargetProstaglandin E2 receptor EP2 subtype(Rattus norvegicus)
Pfizer
Curated by ChEMBL
LigandPNGBDBM50293505(2-(4-(N-(4-butylbenzyl)methylsulfonamido)butoxy)ac...)
Affinity DataIC50:  701nM. Assay description: Inhibition of rat EP2 receptor expressed in HEK293 cells
In DepthDetails ArticlePubMed
TargetProstaglandin E2 receptor EP2 subtype(Rattus norvegicus)
Pfizer
Curated by ChEMBL
LigandPNGBDBM50293505(2-(4-(N-(4-butylbenzyl)methylsulfonamido)butoxy)ac...)
Affinity DataEC50:  407nM. Assay description: Agonist activity against rat EP2 receptor expressed in HEK293 cells assessed as stimulation of cAMP release
In DepthDetails ArticlePubMed
TargetProstaglandin E2 receptor EP4 subtype(Rattus norvegicus)
Pfizer
Curated by ChEMBL
LigandPNGBDBM50293505(2-(4-(N-(4-butylbenzyl)methylsulfonamido)butoxy)ac...)
Affinity DataIC50: >3.20E+3nM. Assay description: Inhibition of rat EP4 receptor expressed in HEK293 cells
In DepthDetails ArticlePubMed