BDBM50293534 1-(3-(5-(3-((2-(dimethylamino)ethyl)carbamoyl)phenyl)-1H-pyrrolo[2,3-b]pyridin-3-yl)phenyl)-3-(2-fluoro-4-(trifluoromethyl)phenyl)urea::CHEMBL538672
SMILES CN(C)CCNC(=O)c1cccc(c1)-c1cnc2[nH]cc(-c3cccc(NC(=O)Nc4ccc(cc4F)C(F)(F)F)c3)c2c1
InChI Key InChIKey=DUHZDYCVHMCXFU-UHFFFAOYSA-N
Data  1 IC50
  Tab Delimited (TSV)   2D SDfile   Computed 3D by Vconf -m prep SDfile
Find this compound or compounds like it in BindingDB:
Activity Spreadsheet -- Enzyme Inhibition Constant Data from BindingDB
Found 1 hit for monomerid = 50293534
TargetInsulin-like growth factor 1 receptor(Homo sapiens (Human))
Glaxosmithkline
Curated by ChEMBL
LigandPNGBDBM50293534(1-(3-(5-(3-((2-(dimethylamino)ethyl)carbamoyl)phen...)
Affinity DataIC50:  67nM. Assay description: Inhibition of GST-tagged human IGF1R expressed in Sf9-baculovirus system
In DepthDetails ArticlePubMed