BDBM50293537 1-(3-chlorophenyl)-3-(3-(5-phenyl-1H-pyrrolo[2,3-b]pyridin-3-yl)phenyl)urea::CHEMBL549932
SMILES Clc1cccc(NC(=O)Nc2cccc(c2)-c2c[nH]c3ncc(cc23)-c2ccccc2)c1
InChI Key InChIKey=XNMPZLAFBSFWMY-UHFFFAOYSA-N
Data  1 IC50
  Tab Delimited (TSV)   2D SDfile   Computed 3D by Vconf -m prep SDfile
Find this compound or compounds like it in BindingDB:
Activity Spreadsheet -- Enzyme Inhibition Constant Data from BindingDB
Found 1 hit for monomerid = 50293537
TargetInsulin-like growth factor 1 receptor(Homo sapiens (Human))
Glaxosmithkline
Curated by ChEMBL
LigandPNGBDBM50293537(1-(3-chlorophenyl)-3-(3-(5-phenyl-1H-pyrrolo[2,3-b...)
Affinity DataIC50:  1.02E+3nM. Assay description: Inhibition of GST-tagged human IGF1R expressed in Sf9-baculovirus system
In DepthDetails ArticlePubMed