BDBM50293648 6-(phenylethynyl)-N-(thiophen-3-ylmethyl)nicotinamide::CHEMBL540426
SMILES O=C(NCc1ccsc1)c1ccc(nc1)C#Cc1ccccc1
InChI Key InChIKey=BFGPEZRNJVDHQO-UHFFFAOYSA-N
Data  1 EC50
  Tab Delimited (TSV)   2D SDfile   Computed 3D by Vconf -m prep SDfile
Find this compound or compounds like it in BindingDB:
Activity Spreadsheet -- Enzyme Inhibition Constant Data from BindingDB
Found 1 hit for monomerid = 50293648
TargetMetabotropic glutamate receptor 5(Homo sapiens (Human))
H. Lundbeck
Curated by ChEMBL
LigandPNGBDBM50293648(6-(phenylethynyl)-N-(thiophen-3-ylmethyl)nicotinam...)
Affinity DataEC50:  140nM. Assay description: Agonist activity at human mGluR5 transiently transfected in BHK cells assessed as potentiation of L-glutamate-induced calcium flux by FLIPR assay
In DepthDetails ArticlePubMed