BDBM50294047 2-(3,3-Diethylthioureido)-4,5-dimethylthiophene-3-carboxylic Acid::CHEMBL571667
SMILES CCN(CC)C(=S)Nc1sc(C)c(C)c1C(O)=O
InChI Key InChIKey=VMSMNSGVPXMUGY-UHFFFAOYSA-N
Data  1 IC50
  Tab Delimited (TSV)   2D SDfile   Computed 3D by Vconf -m prep SDfile
Find this compound or compounds like it in BindingDB:
Activity Spreadsheet -- Enzyme Inhibition Constant Data from BindingDB
Found 1 hit for monomerid = 50294047
TargetMultidrug resistance-associated protein 1(Homo sapiens (Human))
University Of Bonn
Curated by ChEMBL
LigandPNGBDBM50294047(2-(3,3-Diethylthioureido)-4,5-dimethylthiophene-3-...)
Affinity DataIC50:  2.04E+4nM. Assay description: Inhibition of MRP1 expressed in multidrug resistant human 2008 cells assessed as calcein AM accumulation by fluorescence assay in presence of p-gp an...
In DepthDetails ArticlePubMed