BDBM50294202 2-(6-(4-Chlorophenyl)-2,2-dimethyl-7-phenyl-2,3-dihydro-1Hpyrrolizin-5-yl)-N-tosylpropanamide::CHEMBL551236
SMILES Cc1ccc(cc1)S(=O)(=O)NC(=O)CCc1c(c(c2CC(C)(C)Cn12)-c1ccccc1)-c1ccc(Cl)cc1
InChI Key InChIKey=PBOXDWJKYPDQMV-UHFFFAOYSA-N
Data  1 IC50
  Tab Delimited (TSV)   2D SDfile   Computed 3D by Vconf -m prep SDfile
Find this compound or compounds like it in BindingDB:
Activity Spreadsheet -- Enzyme Inhibition Constant Data from BindingDB
Found 1 hit for monomerid = 50294202
TargetProstaglandin E synthase(Homo sapiens (Human))
Eberhard Karls University Tuebingen
Curated by ChEMBL
LigandPNGBDBM50294202(2-(6-(4-Chlorophenyl)-2,2-dimethyl-7-phenyl-2,3-di...)
Affinity DataIC50:  2.10E+3nM. Assay description: Inhibition of mPGES1 in IL-1beta treated human A549 cell microsomal membrane assessed as residual enzyme activity after 1 min by measuring PGE2 level...
In DepthDetails ArticlePubMed