BDBM50294479 CHEMBL563570::S-nebularinehomocysteine
SMILES N[C@@H](CCSC[C@H]1O[C@H]([C@H](O)[C@@H]1O)n1cnc2cncnc12)C(O)=O
InChI Key InChIKey=PBQISZQQRZEGMN-ARYVQYHZSA-N
Data  2 IC50
  Tab Delimited (TSV)   2D SDfile   Computed 3D by Vconf -m prep SDfile
Find this compound or compounds like it in BindingDB:
Activity Spreadsheet -- Enzyme Inhibition Constant Data from BindingDB
Found 2 hits for monomerid = 50294479
TargetDNA (cytosine-5)-methyltransferase 3B(Homo sapiens (Human))
Methylgene
Curated by ChEMBL
LigandPNGBDBM50294479(CHEMBL563570 | S-nebularinehomocysteine)
Affinity DataIC50:  2.80E+4nM. Assay description: Inhibition of human recombinant DNMT3b2 expressed in baculovirus infected high five insect cells
In DepthDetails ArticlePubMed
TargetDNA (cytosine-5)-methyltransferase 1(Homo sapiens (Human))
Methylgene
Curated by ChEMBL
LigandPNGBDBM50294479(CHEMBL563570 | S-nebularinehomocysteine)
Affinity DataIC50:  3.00E+5nM. Assay description: Inhibition of human recombinant DNMT1 expressed in baculovirus infected high five insect cells
In DepthDetails ArticlePubMed