BDBM50294489 2-amino-4-(((2S,3S,4R,5R)-5-(6-amino-2-methoxy-9H-purin-9-yl)-3,4-dihydroxy-tetrahydrofuran-2-yl)methylthio)butanoic acid::CHEMBL560165
SMILES COc1nc(N)c2ncn([C@@H]3O[C@H](CSCCC(N)C(O)=O)[C@@H](O)[C@H]3O)c2n1
InChI Key InChIKey=VVADSJZSHIZJBJ-ZRURSIFKSA-N
Data  1 IC50
  Tab Delimited (TSV)   2D SDfile   Computed 3D by Vconf -m prep SDfile
Find this compound or compounds like it in BindingDB:
Activity Spreadsheet -- Enzyme Inhibition Constant Data from BindingDB
Found 1 hit for monomerid = 50294489
TargetDNA (cytosine-5)-methyltransferase 1(Homo sapiens (Human))
Methylgene
Curated by ChEMBL
LigandPNGBDBM50294489(2-amino-4-(((2S,3S,4R,5R)-5-(6-amino-2-methoxy-9H-...)
Affinity DataIC50:  7.50E+4nM. Assay description: Inhibition of human recombinant DNMT1 expressed in baculovirus infected high five insect cells
In DepthDetails ArticlePubMed