BDBM50294716 4-((2-chlorobenzyl)(2-methyl-1-(4-methyl-4H-1,2,4-triazol-3-yl)propyl)amino)-2-chlorobenzonitrile::CHEMBL552156
SMILES CC(C)C(N(Cc1ccccc1Cl)c1ccc(C#N)c(Cl)c1)c1nncn1C
InChI Key InChIKey=BNFIULLBFOWELZ-UHFFFAOYSA-N
Data  2 IC50  1 EC50
  Tab Delimited (TSV)   2D SDfile   Computed 3D by Vconf -m prep SDfile
Find this compound or compounds like it in BindingDB:
Activity Spreadsheet -- Enzyme Inhibition Constant Data from BindingDB
Found 3 hits for monomerid = 50294716
TargetProgesterone receptor(Homo sapiens (Human))
Glaxosmithkline
Curated by ChEMBL
LigandPNGBDBM50294716(4-((2-chlorobenzyl)(2-methyl-1-(4-methyl-4H-1,2,4-...)
Affinity DataIC50:  32nM. Assay description: Binding affinity to progesterone receptor ligand binding domain by fluorimetric assay
In DepthDetails ArticlePubMed
TargetCytochrome P450 2C19(Homo sapiens (Human))
Glaxosmithkline
Curated by ChEMBL
LigandPNGBDBM50294716(4-((2-chlorobenzyl)(2-methyl-1-(4-methyl-4H-1,2,4-...)
Affinity DataIC50:  63nM. Assay description: Inhibition of CYP2C19
In DepthDetails ArticlePubMed
TargetProgesterone receptor(Homo sapiens (Human))
Glaxosmithkline
Curated by ChEMBL
LigandPNGBDBM50294716(4-((2-chlorobenzyl)(2-methyl-1-(4-methyl-4H-1,2,4-...)
Affinity DataEC50:  4.70nM. Assay description: Agonist activity at progesterone receptor in human T47D cells by alkaline phosphatase release based reporter gene assay
In DepthDetails ArticlePubMed